{"text_format":"1","workbook":"xlsx","n_sheets":9,"sheets":["Wordle","Stats_dark","Stats_light","Instructions","Administrator","User Scores","to copy","wordle word list","keyboard working"],"not_rendered":{"charts":4,"images":6,"macros":1,"external_links":0,"defined_names":1,"comments":0,"pivot_tables":0},"unopened":[],"bounds":{"document_bytes":16777216,"sheet_cells":100000,"rows_first":2000,"rows_last":500,"rows_between":2000,"halvings":0,"cell_chars":16384,"cell_head_chars":4096},"cells_cut":0,"cells_raw":0,"read":"whole","date_system":"1900"}

{"sheet":"Wordle","index":0,"n_rows":34,"n_cols":32,"rows_kept":34,"cut":false,"hidden":false,"merged":[[32,1,32,12]]}
[]
[]
[]
[]
[]
[null,null,null,null,null,null,null,null,null,null,null,null,null,null,null,null,null,"R","R",null,"R",null,null,"R",null,"R",null,"R",null,"R"]
[]
[null,null,null,null,null,null,null,null,null,null,null,null,null,null,null,null,null,null,null,null,null,null,null,null,"row",1]
[]
[null,null,null,null,null,null,null,null,null,null,null,null,null,null,null,null,null,"R","R",{"$f":"COLUMN(T11)","v":20},null,null,null,null,"letter",1]
[]
[]
[]
[]
[]
[null,null,null,null,null,null,null,null,null,null,null,null,null,null,null,null,null,"in wrong","in right",null,"dark gray"]
[null,null,null,null,null,null,null,null,null,null,null,null,null,null,null,null,"R",216,108,null,64,null,null,null,null,null,null,"DAILY",null,null,"RANDOM/PRACTICE"]
[null,null,null,null,null,null,null,null,null,null,null,null,null,null,null,null,"G",194,166,null,64,null,null,null,null,null,null,"no guesses","qty",null,"no guesses","qty"]
[null,null,null,null,null,null,null,null,null,null,null,null,null,null,null,null,"B",64,44,null,64,null,null,null,null,null,null,1,0,null,1,0]
[null,null,null,null,null,null,null,null,null,null,null,null,null,null,null,null,null,null,null,null,null,null,null,null,"active word:","these",null,2,1,null,2,2]
[null,null,null,null,null,null,null,null,null,null,null,null,null,null,null,null,null,null,null,null,null,null,null,null,"hard mode:","no",null,3,2,null,3,1]
[null,null,null,null,null,null,null,null,null,null,null,null,null,null,null,null,null,null,"gray button background",null,null,null,null,null,"dark/light:","dark",null,4,0,null,4,1]
[null,null,null,null,null,null,null,null,null,null,null,null,null,null,null,null,null,null,166,null,null,null,null,null,"colorblind:","no",null,5,0,null,5,7]
[null,null,null,null,null,null,null,null,null,null,null,null,null,null,null,null,null,null,166,null,null,null,null,null,"today:",{"$f":"TODAY()","v":"2022-04-22"},null,6,0,null,6,3]
[null,null,null,null,null,null,null,null,null,null,null,null,null,null,null,null,null,null,166,null,null,null,null,null,"today's word:",{"$f":"INDEX('wordle word list'!A2:A2317,MATCH(Wordle!Z24,'wordle word list'!C2:C2317,0))","v":"abbot"},null,"total wins",3,null,"total wins",14]
[null,null,null,null,null,null,null,null,null,null,null,null,null,null,null,null,null,null,null,null,null,null,null,null,null,null,null,"avg guesses",{"$f":"AVERAGE(AC19:AC24)","v":0.5},null,"avg guesses",{"$f":"AVERAGE(AF19:AF24)","v":2.3333333333333335}]
[null,null,null,null,null,null,null,null,null,null,null,null,null,null,null,null,null,"yellow","green",null,null,null,null,null,null,null,null,"total losses",0,null,"total losses",0]
[null,null,null,null,null,null,null,null,null,null,null,null,null,null,null,null,null,216,108,null,null,null,null,null,null,null,null,"win %",{"$f":"IF((AC25+AC27)=0, 0, AC25/(AC25+AC27))","v":1},null,"win %",{"$f":"IF((AF25+AF27)=0, 0, AF25/(AF25+AF27))","v":1}]
[null,null,null,null,null,null,null,null,null,null,null,null,null,null,null,null,null,194,166,null,null,null,null,null,null,null,null,"current streak",3,null,"current streak",14]
[null,null,null,null,null,null,null,null,null,null,null,null,null,null,null,null,null,64,44,null,null,null,null,null,null,null,null,"longest streak",3,null,"longest streak",14]
[null,null,null,null,null,null,null,null,null,null,null,null,null,null,null,null,null,"blue","orange"]
[null,null,null,null,null,null,null,null,null,null,null,null,null,null,null,null,null,134,240,null,null,null,null,null,null,null,null,"last date played","2022-04-21"]
[null,"Wordle Excel clone provided by EXCEL RAIN MAN. Please visit us for more info. Also visit https://www.nytimes.com/games/wordle/index.html to play the official version of Wordle.",null,null,null,null,null,null,null,null,null,null,null,null,null,null,null,178,125]
[null,null,null,null,null,null,null,null,null,null,null,null,null,null,null,null,null,218,10,null,null,"longest streak"]

{"sheet":"Stats_dark","index":1,"n_rows":22,"n_cols":26,"rows_kept":22,"cut":false,"hidden":true,"merged":[[1,1,1,5],[5,1,5,5],[1,7,1,11],[5,7,5,11]]}
[]
[null,"DAILY WORD STATISTICS",null,null,null,null,null,"RANDOM/PRACTICE WORD STATISTICS"]
[null,{"$f":"Wordle!AC25+Wordle!AC27","v":3},{"$f":"Wordle!AC28","v":1},{"$f":"Wordle!AC29","v":3},{"$f":"Wordle!AC30","v":3},{"$f":"Wordle!AC26","v":0.5},null,{"$f":"Wordle!AF25+Wordle!AF27","v":14},{"$f":"Wordle!AF28","v":1},{"$f":"Wordle!AF29","v":14},{"$f":"Wordle!AF30","v":14},{"$f":"Wordle!AF26","v":2.3333333333333335}]
[null,"Played","Win %","Current Streak","Max Streak","Average Guesses",null,"Played","Win %","Current Streak","Max Streak","Average Guesses"]
[]
[null,"GUESS DISTRIBUTION",null,null,null,null,null,"GUESS DISTRIBUTION"]
[]
[null,1,{"$f":"Wordle!AC19","v":0},null,null,null,null,1,{"$f":"Wordle!AF19","v":0}]
[null,2,{"$f":"Wordle!AC20","v":1},null,null,null,null,2,{"$f":"Wordle!AF20","v":2}]
[null,3,{"$f":"Wordle!AC21","v":2},null,null,null,null,3,{"$f":"Wordle!AF21","v":1}]
[null,4,{"$f":"Wordle!AC22","v":0},null,null,null,null,4,{"$f":"Wordle!AF22","v":1}]
[null,5,{"$f":"Wordle!AC23","v":0},null,null,null,null,5,{"$f":"Wordle!AF23","v":7}]
[null,6,{"$f":"Wordle!AC24","v":0},null,null,null,null,6,{"$f":"Wordle!AF24","v":3}]
[]
[]
[]
[]
[]
[]
[]
[]
[null,null,null,null,null,null,null,null,null,null,null,null,null,null,null,null,null,null,null,null,null,null,null,null,null,"dark"]

{"sheet":"Stats_light","index":2,"n_rows":22,"n_cols":26,"rows_kept":22,"cut":false,"hidden":true,"merged":[[1,1,1,5],[1,7,1,11],[5,1,5,5],[5,7,5,11]]}
[]
[null,"DAILY WORD STATISTICS",null,null,null,null,null,"RANDOM/PRACTICE WORD STATISTICS"]
[null,{"$f":"Wordle!AC25+Wordle!AC27","v":3},{"$f":"Wordle!AC28","v":1},{"$f":"Wordle!AC29","v":3},{"$f":"Wordle!AC30","v":3},{"$f":"Wordle!AC26","v":0.5},null,{"$f":"Wordle!AF25+Wordle!AF27","v":14},{"$f":"Wordle!AF28","v":1},{"$f":"Wordle!AF29","v":14},{"$f":"Wordle!AF30","v":14},{"$f":"Wordle!AF26","v":2.3333333333333335}]
[null,"Played","Win %","Current Streak","Max Streak","Average Guesses",null,"Played","Win %","Current Streak","Max Streak","Average Guesses"]
[]
[null,"GUESS DISTRIBUTION",null,null,null,null,null,"GUESS DISTRIBUTION"]
[]
[null,1,{"$f":"Wordle!AC19","v":0},null,null,null,null,1,{"$f":"Wordle!AF19","v":0}]
[null,2,{"$f":"Wordle!AC20","v":1},null,null,null,null,2,{"$f":"Wordle!AF20","v":2}]
[null,3,{"$f":"Wordle!AC21","v":2},null,null,null,null,3,{"$f":"Wordle!AF21","v":1}]
[null,4,{"$f":"Wordle!AC22","v":0},null,null,null,null,4,{"$f":"Wordle!AF22","v":1}]
[null,5,{"$f":"Wordle!AC23","v":0},null,null,null,null,5,{"$f":"Wordle!AF23","v":7}]
[null,6,{"$f":"Wordle!AC24","v":0},null,null,null,null,6,{"$f":"Wordle!AF24","v":3}]
[]
[]
[]
[]
[]
[]
[]
[]
[null,null,null,null,null,null,null,null,null,null,null,null,null,null,null,null,null,null,null,null,null,null,null,null,null,"dark"]

{"sheet":"Instructions","index":3,"n_rows":29,"n_cols":17,"rows_kept":29,"cut":false,"hidden":true,"merged":[[1,1,1,12]]}
[]
[null,"HOW TO PLAY"]
[null,"Guess the WORDLE in six tries. Use the on-screen keys to type your guess."]
[]
[null,"Each guess must be a valid five-letter word. Hit the enter button to submit."]
[]
[null,"After each guess, the color of the tiles will change to show how close your "]
[null,"guess was to the word."]
[]
[]
[null,"EXAMPLES"]
[]
[null,"W",null,"E",null,"A",null,"R",null,"Y",null,null,null,null,null,null,"W"]
[]
[null,"The letter W is in the work and in the correct spot."]
[]
[null,"P",null,"I",null,"L",null,"L",null,"S",null,null,null,null,null,null,"I"]
[]
[null,"The letter I is in the word but in the wrong spot."]
[]
[null,"V",null,"A",null,"G",null,"U",null,"E",null,null,null,null,null,null,"U"]
[]
[null,"The letter U is not in the word in any spot."]
[]
[]
[]
[null,"If you want to play the same daily word as your friends, and maybe even"]
[null,"compete on who can solve the most words or use the fewest guesses,"]
[null,"check out the Administrator instructions by clicking the button below."]

{"sheet":"Administrator","index":4,"n_rows":28,"n_cols":4,"rows_kept":28,"cut":false,"hidden":true,"merged":[[1,5,1,7],[27,1,29,4]]}
[]
[null,"Administrator Instructions"]
[]
[null,null,"About"]
[null,null,"Welcome to Excel Rainman's Wordle hosting game, in Excel! The purpose of this Administrator sheet is to allow you to send this file to a group of people,"]
[null,null,"then you all play Wordle with the same daily word. After whatever time period you would like, everyone in the group sends you (the Administrator) their "]
[null,null,"Excel files for scoring. You then click the \"Score Files\" button, and see how well everyone did!"]
[]
[null,null,"1. Randomize word list"]
[null,null,"Step 1 is to get your group a unique list of daily words. In order to do that, click the \"Randomize Word List\" button below."]
[null,null,"When are asked if you're sure you want to reset stats, click Yes."]
[]
[null,null,"2. Send to friends"]
[null,null,"Click the button \"Hide Administrator Sheet\", save the file, and send it out to your group."]
[]
[null,null,"3. Score the results"]
[null,null,"Click the \"Score Results\" button below. Note that the sheet used by the Administrator will also be scored."]
[null,null,"You will then be prompted to select the Excel files sent back to you by your group."]
[null,null,"Select all of the files at the same time (hold down the ctrl key) and click Open. The results will be scored! "]
[null,null,"The way the results are scored is configurable below (default is 33.33% for all three categories)."]
[]
[null,null,"Scoring Category Weights"]
[null,null,"Win Percentage: ",0.33333299999999999]
[null,null,"Longest Streak: ",0.33333299999999999]
[null,null,"Avg. No. Guesses: ",{"$f":"1-SUM(D23:D24)","v":0.33333400000000002}]
[]
[]
[null,"Wordle Excel clone provided by EXCEL RAIN MAN. Please visit us For more info. Also visit https://www.nytimes.com/games/wordle/index.html to play the official version of Wordle."]

{"sheet":"User Scores","index":5,"n_rows":27,"n_cols":23,"rows_kept":27,"cut":false,"hidden":true,"merged":[[3,2,3,3],[26,1,28,6],[1,5,1,9]]}
[]
[null,"Administrator Instructions"]
[]
[null,null,"Scoring Category Weights"]
[null,null,"Win Percentage: ",{"$f":"Administrator!$D$23","v":0.33333299999999999}]
[null,null,"Longest Streak: ",{"$f":"Administrator!$D$23","v":0.33333299999999999}]
[null,null,"Avg. No. Guesses: ",{"$f":"Administrator!$D$23","v":0.33333299999999999}]
[]
[null,null,"Name","Win %","Longest Streak","Avg. Guesses","Win% Score","Streak Score","Guesses Score","Total Weighted Score",null,null,null,null,null,"Name","Win %","Longest Streak","Avg. Guesses","Win% Score","Streak Score","Guesses Score","Total Weighted Score"]
[null,null,null,null,null,null,null,null,null,null,null,null,null,null,null,"Name1",0.1,12,4.22,{"$f":"Q10/MAX(Q$10:Q$24)","v":1},{"$f":"R10/MAX(R$10:R$24)","v":1},{"$f":"S10/MAX(S$10:S$24)","v":1},{"$f":"(T10*$D$5+U10*$D$6+V10*$D$7)*100","v":99.999899999999997}]
[null,null,null,null,null,null,null,null,null,null,null,null,null,null,null,"Name2",0.1,12,4.22,{"$f":"Q11/MAX(Q$10:Q$24)","v":1},1,1,{"$f":"(T11*$D$5+U11*$D$6+V11*$D$7)*100","v":99.999899999999997}]
[]
[]
[]
[]
[]
[]
[]
[]
[]
[]
[]
[]
[]
[]
[]
[null,"Wordle Excel clone provided by EXCEL RAIN MAN. Please visit us For more info. Also visit https://www.nytimes.com/games/wordle/index.html to play the official version of Wordle."]

{"sheet":"to copy","index":6,"n_rows":0,"n_cols":0,"rows_kept":0,"cut":false,"hidden":true,"merged":[]}

{"sheet":"wordle word list","index":7,"n_rows":2317,"n_cols":14,"rows_kept":2317,"cut":false,"hidden":true,"merged":[]}
["Word List","Rand","Date",null,"Total No. Words:",{"$f":"COUNTA(A2:A100001)","v":2316},null,null,null,"Word List (original order)"]
["ionic",8.3284374934944339E-4,"2022-04-15",null,"Start Date:","2022-04-15",null,null,null,"cigar"]
["sooth",8.6630772509743714E-4,{"$f":"C2+1","v":"2022-04-16"},null,null,null,null,null,null,"rebut",null,null,null,"Source"]
["mocha",9.9005027520171485E-4,{"$f":"C3+1","v":"2022-04-17"},null,null,null,null,null,null,"sissy",null,null,null,"https://github.com/hannahcode/wordle"]
["mimic",1.583922980112451E-3,"2022-04-18",null,null,null,null,null,null,"humph",null,null,null,"https://github.com/hannahcode/wordle/blob/main/src/constants/wordlist.ts"]
["patch",2.0012102097253237E-3,"2022-04-19",null,null,null,null,null,null,"awake"]
["baton",2.3857439773744549E-3,"2022-04-20",null,null,null,null,null,null,"blush"]
["booth",2.4981425468004748E-3,"2022-04-21",null,null,null,null,null,null,"focal"]
["abbot",2.9943388643254298E-3,"2022-04-22",null,null,null,null,null,null,"evade"]
["irony",3.3826075132017408E-3,"2022-04-23",null,null,null,null,null,null,"naval"]
["ounce",3.6629538853710786E-3,"2022-04-24",null,null,null,null,null,null,"serve"]
["spare",4.1511076463447427E-3,"2022-04-25",null,null,null,null,null,null,"heath"]
["gummy",4.1929544256306128E-3,"2022-04-26",null,null,null,null,null,null,"dwarf"]
["islet",4.4710455664390691E-3,"2022-04-27",null,null,null,null,null,null,"model"]
["louse",5.4550430596601585E-3,"2022-04-28",null,null,null,null,null,null,"karma"]
["flier",5.5375421049672635E-3,"2022-04-29",null,null,null,null,null,null,"stink"]
["steel",5.7223387720116703E-3,"2022-04-30",null,null,null,null,null,null,"grade"]
["soapy",5.9792556222207915E-3,"2022-05-01",null,null,null,null,null,null,"quiet"]
["share",6.2622572527916143E-3,"2022-05-02",null,null,null,null,null,null,"bench"]
["reedy",6.3039210754375352E-3,"2022-05-03",null,null,null,null,null,null,"abate"]
["train",6.5843734472363913E-3,"2022-05-04",null,null,null,null,null,null,"feign"]
["golem",6.8605191797982412E-3,"2022-05-05",null,null,null,null,null,null,"major"]
["ingot",7.4079586256183827E-3,"2022-05-06",null,null,null,null,null,null,"death"]
["bevel",8.7585354022486905E-3,"2022-05-07",null,null,null,null,null,null,"fresh"]
["baron",9.7631995431276541E-3,"2022-05-08",null,null,null,null,null,null,"crust"]
["slope",1.0155772519688688E-2,"2022-05-09",null,null,null,null,null,null,"stool"]
["puree",1.0543483536007758E-2,"2022-05-10",null,null,null,null,null,null,"colon"]
["under",1.0979991013454149E-2,"2022-05-11",null,null,null,null,null,null,"abase"]
["diary",1.2969037802794348E-2,"2022-05-12",null,null,null,null,null,null,"marry"]
["plaid",1.4110065102873826E-2,"2022-05-13",null,null,null,null,null,null,"react"]
["press",1.4385432368591577E-2,"2022-05-14",null,null,null,null,null,null,"batty"]
["dusky",1.5118732038568172E-2,"2022-05-15",null,null,null,null,null,null,"pride"]
["embed",1.5200882793943049E-2,"2022-05-16",null,null,null,null,null,null,"floss"]
["gland",1.539108785403609E-2,"2022-05-17",null,null,null,null,null,null,"helix"]
["cider",1.6910696708971162E-2,"2022-05-18",null,null,null,null,null,null,"croak"]
["impel",1.7188958558426948E-2,"2022-05-19",null,null,null,null,null,null,"staff"]
["neigh",1.719061171033176E-2,"2022-05-20",null,null,null,null,null,null,"paper"]
["spike",1.7259960141912112E-2,"2022-05-21",null,null,null,null,null,null,"unfed"]
["smirk",1.7264612073971008E-2,"2022-05-22",null,null,null,null,null,null,"whelp"]
["cheat",1.8221866794104424E-2,"2022-05-23",null,null,null,null,null,null,"trawl"]
["stamp",1.8405361396927167E-2,"2022-05-24",null,null,null,null,null,null,"outdo"]
["nymph",1.8806652295811133E-2,"2022-05-25",null,null,null,null,null,null,"adobe"]
["itchy",1.9597155596544735E-2,"2022-05-26",null,null,null,null,null,null,"crazy"]
["algae",2.1197754127273205E-2,"2022-05-27",null,null,null,null,null,null,"sower"]
["biome",2.1250281233522794E-2,"2022-05-28",null,null,null,null,null,null,"repay"]
["whiny",2.144693949653298E-2,"2022-05-29",null,null,null,null,null,null,"digit"]
["cleat",2.1758359801719251E-2,"2022-05-30",null,null,null,null,null,null,"crate"]
["kneed",2.1973990083211437E-2,"2022-05-31",null,null,null,null,null,null,"cluck"]
["bawdy",2.2023781531101516E-2,"2022-06-01",null,null,null,null,null,null,"spike"]
["fritz",2.2127098063380202E-2,"2022-06-02",null,null,null,null,null,null,"mimic"]
["puppy",2.2710924637297181E-2,"2022-06-03",null,null,null,null,null,null,"pound"]
["kinky",2.2716292707339547E-2,"2022-06-04",null,null,null,null,null,null,"maxim"]
["flask",2.2841995170650775E-2,"2022-06-05",null,null,null,null,null,null,"linen"]
["organ",2.3153524817448923E-2,"2022-06-06",null,null,null,null,null,null,"unmet"]
["merit",2.3528446307196971E-2,"2022-06-07",null,null,null,null,null,null,"flesh"]
["acorn",2.3702259393387548E-2,"2022-06-08",null,null,null,null,null,null,"booby"]
["theme",2.3788712820074776E-2,"2022-06-09",null,null,null,null,null,null,"forth"]
["ennui",2.3820860919777531E-2,"2022-06-10",null,null,null,null,null,null,"first"]
["prowl",2.4476010261745396E-2,"2022-06-11",null,null,null,null,null,null,"stand"]
["sling",2.5351349487957031E-2,"2022-06-12",null,null,null,null,null,null,"belly"]
["point",2.5943152169386807E-2,"2022-06-13",null,null,null,null,null,null,"ivory"]
["joker",2.7031793537856008E-2,"2022-06-14",null,null,null,null,null,null,"seedy"]
["later",2.7243476535743327E-2,"2022-06-15",null,null,null,null,null,null,"print"]
["twist",2.7713868217125515E-2,"2022-06-16",null,null,null,null,null,null,"yearn"]
["erode",2.8030166406911694E-2,"2022-06-17",null,null,null,null,null,null,"drain"]
["punch",2.8981746500710837E-2,"2022-06-18",null,null,null,null,null,null,"bribe"]
["dopey",2.9109571170835236E-2,"2022-06-19",null,null,null,null,null,null,"stout"]
["dodge",2.9160853125731356E-2,{"$f":"C67+1","v":"2022-06-20"},null,null,null,null,null,null,"panel"]
["scram",3.0117431724000054E-2,"2022-06-21",null,null,null,null,null,null,"crass"]
["groin",3.0674301833461648E-2,"2022-06-22",null,null,null,null,null,null,"flume"]
["stone",3.1650837413864319E-2,"2022-06-23",null,null,null,null,null,null,"offal"]
["grunt",3.1673742800771398E-2,"2022-06-24",null,null,null,null,null,null,"agree"]
["whack",3.2085419788019043E-2,"2022-06-25",null,null,null,null,null,null,"error"]
["dingo",3.210879514106213E-2,"2022-06-26",null,null,null,null,null,null,"swirl"]
["mango",3.2767979889001486E-2,"2022-06-27",null,null,null,null,null,null,"argue"]
["breed",3.2898568007544537E-2,"2022-06-28",null,null,null,null,null,null,"bleed"]
["flack",3.3189839198421445E-2,"2022-06-29",null,null,null,null,null,null,"delta"]
["catch",3.3192750915289504E-2,"2022-06-30",null,null,null,null,null,null,"flick"]
["enema",3.3548441787905947E-2,"2022-07-01",null,null,null,null,null,null,"totem"]
["loser",3.4110583948720907E-2,"2022-07-02",null,null,null,null,null,null,"wooer"]
["verge",3.4361926682666688E-2,"2022-07-03",null,null,null,null,null,null,"front"]
["clung",3.4621289032364277E-2,"2022-07-04",null,null,null,null,null,null,"shrub"]
["pygmy",3.4674016238715688E-2,"2022-07-05",null,null,null,null,null,null,"parry"]
["begin",3.4792120316790132E-2,"2022-07-06",null,null,null,null,null,null,"biome"]
["drawl",3.4893707574093269E-2,"2022-07-07",null,null,null,null,null,null,"lapel"]
["maple",3.7018790146371883E-2,"2022-07-08",null,null,null,null,null,null,"start"]
["ditto",3.7318339294933889E-2,"2022-07-09",null,null,null,null,null,null,"greet"]
["wrist",3.7506483950104585E-2,"2022-07-10",null,null,null,null,null,null,"goner"]
["refer",3.7634512315504076E-2,"2022-07-11",null,null,null,null,null,null,"golem"]
["poser",3.8030611458541808E-2,"2022-07-12",null,null,null,null,null,null,"lusty"]
["piano",3.8359852421540164E-2,"2022-07-13",null,null,null,null,null,null,"loopy"]
["rogue",3.8389284483983599E-2,"2022-07-14",null,null,null,null,null,null,"round"]
["vivid",3.963025954851418E-2,"2022-07-15",null,null,null,null,null,null,"audit"]
["grove",3.9941736686832541E-2,"2022-07-16",null,null,null,null,null,null,"lying"]
["briny",4.0086569519739101E-2,"2022-07-17",null,null,null,null,null,null,"gamma"]
["goner",4.0228779752385146E-2,"2022-07-18",null,null,null,null,null,null,"labor"]
["shrub",4.0233871659468901E-2,"2022-07-19",null,null,null,null,null,null,"islet"]
["filth",4.0737901843425517E-2,"2022-07-20",null,null,null,null,null,null,"civic"]
["stack",4.0948548228165849E-2,"2022-07-21",null,null,null,null,null,null,"forge"]
["tower",4.1350867279903336E-2,"2022-07-22",null,null,null,null,null,null,"corny"]
["enter",4.1589484187339543E-2,"2022-07-23",null,null,null,null,null,null,"moult"]
["yacht",4.1894664634922751E-2,"2022-07-24",null,null,null,null,null,null,"basic"]
["cacao",4.3077746157466512E-2,"2022-07-25",null,null,null,null,null,null,"salad"]
["worth",4.3288535067291467E-2,"2022-07-26",null,null,null,null,null,null,"agate"]
["scare",4.3401370112976179E-2,"2022-07-27",null,null,null,null,null,null,"spicy"]
["toast",4.3734989923229661E-2,"2022-07-28",null,null,null,null,null,null,"spray"]
["fibre",4.3861276276741856E-2,"2022-07-29",null,null,null,null,null,null,"essay"]
["spore",4.4368564878118466E-2,"2022-07-30",null,null,null,null,null,null,"fjord"]
["trawl",4.4444121142831361E-2,"2022-07-31",null,null,null,null,null,null,"spend"]
["local",4.6900338593057866E-2,"2022-08-01",null,null,null,null,null,null,"kebab"]
["raven",4.7065057683929545E-2,"2022-08-02",null,null,null,null,null,null,"guild"]
["bench",4.7141300646425077E-2,"2022-08-03",null,null,null,null,null,null,"aback"]
["tooth",4.7250922492617198E-2,"2022-08-04",null,null,null,null,null,null,"motor"]
["title",4.7317037944984985E-2,"2022-08-05",null,null,null,null,null,null,"alone"]
["inlet",4.7656553869149798E-2,"2022-08-06",null,null,null,null,null,null,"hatch"]
["often",4.8352921019424233E-2,"2022-08-07",null,null,null,null,null,null,"hyper"]
["kappa",4.8486586472870408E-2,"2022-08-08",null,null,null,null,null,null,"thumb"]
["hippy",4.8818892914796908E-2,"2022-08-09",null,null,null,null,null,null,"dowry"]
["paper",4.9721913801967554E-2,"2022-08-10",null,null,null,null,null,null,"ought"]
["glyph",5.0154028485480118E-2,"2022-08-11",null,null,null,null,null,null,"belch"]
{"$rows_left_out":2198}
{"sheet":"keyboard working","index":8,"n_rows":0,"n_cols":0,"rows_kept":0,"cut":false,"hidden":true,"merged":[]}